Target
Cyclin-dependent kinase 4/G1/S-specific cyclin-D1
Ligand
BDBM12619
Substrate
GST-Rb fusion protein
Meas. Tech.
Homogeneous Time-resolved Fluorescence (HTRF) Assay
Ki
3±n/a nM
Citation
 Chu, XJDePinto, WBartkovitz, DSo, SSVu, BTPackman, KLukacs, CDing, QJiang, NWang, KGoelzer, PYin, XSmith, MAHiggins, BXChen, YXiang, QMoliterni, JKaplan, GGraves, BLovey, AFotouhi, N Discovery of [4-Amino-2-(1-methanesulfonylpiperidin-4-ylamino)pyrimidin-5-yl](2,3-difluoro-6-methoxyphenyl)methanone (R547), a potent and selective cyclin-dependent kinase inhibitor with significant in vivo antitumor activity. J Med Chem 49:6549-60 (2006)  
Target
Name:
Cyclin-dependent kinase 4/G1/S-specific cyclin-D1
Synonyms:
CDK4/CycD CDK4/Cyclin D1 Cyclin-Dependent Kinase 4 (CDK4) Cyclin-dependent kinase 4/G1/S-specific cyclin D1 | Cyclin-dependent kinase 4/cyclin D1
Type:
Protein Complex
Mol. Mass.:
Description:
CDK4/D1 complexes were purified from insect cells co-infected with baculovirus vectors containing each of the components.
Components:
This complex has 2 components.
Component 1
Name:
Cyclin-dependent kinase 4
Synonyms:
CDK4 Cell division protein kinase 4 PSK-J3
Type:
Enzyme Subunit
Mol. Mass.:
33731.96
Organism:
Homo sapiens (Human)
Description:
P11802
Residue:
303
  
Component 2
Name:
G1/S-specific cyclin-D1
Synonyms:
B-cell lymphoma 1 protein BCL-1 oncogene CCND1 PRAD1 | PRAD1 oncogene
Type:
Enzyme Subunit
Mol. Mass.:
33717.70
Organism:
Homo sapiens (Human)
Description:
Residue:
295
  
Inhibitor
Name:
BDBM12619
Synonyms:
2,4-Diamino-5-ketopyrimidine 37 [4-Amino-2-(1-methanesulfonylpiperidin-4-ylamino)pyrimidin-5-yl](2-fluoro-6-methoxyphenyl)methanone
Type:
Small organic molecule
Emp. Form.:
C18H22FN5O4S
Mol. Mass.:
423.462
SMILES:
COc1cccc(F)c1C(=O)c1cnc(NC2CCN(CC2)S(C)(=O)=O)nc1N
:
Substrate
Name:
GST-Rb fusion protein
Synonyms:
Glutathione S-transferase (GST)-retinoblastoma (Rb) fusion RB1 Rb | retinoblastoma
Type:
Other Protein Type
Mol. Mass.:
106410.17
Organism:
Homo sapiens (Human)
Description:
GST-60 kDa Rb fusion protein (comprising amino acids 378 to 928 of retinoblastoma)
Residue:
928