Target
Dipeptidyl peptidase 4
Ligand
BDBM12626
Substrate
BDBM11057
Meas. Tech.
DPPIV Inhibition Assay
pH
7.5±n/a
Temperature
295.15±n/a K
Ki
8±n/a nM
Citation
 Madar, DJKopecka, HPireh, DYong, HPei, ZLi, XWiedeman, PEDjuric, SWVon Geldern, TWFickes, MGBhagavatula, LMcDermott, TWittenberger, SRichards, SJLongenecker, KLStewart, KDLubben, THBallaron, SJStashko, MALong, MAWells, HZinker, BAMika, AKBeno, DWKempf-Grote, AJPolakowski, JSegreti, JReinhart, GAFryer, RMSham, HLTrevillyan, JM Discovery of 2-[4-{{2-(2S,5R)-2-cyano-5-ethynyl-1-pyrrolidinyl]-2-oxoethyl]amino]-4-methyl-1-piperidinyl]-4-pyridinecarboxylic acid (ABT-279): a very potent, selective, effective, and well-tolerated inhibitor of dipeptidyl peptidase-IV, useful for the treatment of diabetes. J Med Chem 49:6416-20 (2006)  
Target
Name:
Dipeptidyl peptidase 4
Synonyms:
ADABP Adenosine deaminase complexing protein 2 CD_antigen=CD26 DPP4 DPPIV Dipeptidyl peptidase 4 (DPP IV) Dipeptidyl peptidase 4 (DPP4) Dipeptidyl peptidase 4 membrane form Dipeptidyl peptidase IV Dipeptidyl peptidase IV (DDP-IV) Dipeptidyl peptidase IV membrane form Dipeptidyl peptidase-IV (DPP-4) T-cell activation antigen CD26 | TP103
Type:
Enzyme
Mol. Mass.:
88271.01
Organism:
Homo sapiens (Human)
Description:
P27487
Residue:
766
  
Inhibitor
Name:
BDBM12626
Synonyms:
(2S,5R)-1-[(2S)-2-amino-4-methylpentanoyl]-5-ethynylpyrrolidine-2-carbonitrile C5-substituted pyrrolidine 14
Type:
Small organic molecule
Emp. Form.:
C13H19N3O
Mol. Mass.:
233.3095
SMILES:
CC(C)C[C@H](N)C(=O)N1[C@H](CC[C@H]1C#N)C#C
:
Substrate
Name:
BDBM11057
Synonyms:
1-(2-aminoacetyl)-N-(4-methyl-2-oxo-2H-chromen-7-yl)pyrrolidine-2-carboxamide hydrobromide Gly-Pro-7-amidomethylcoumarin | Gly-Pro-AMC
Type:
Small organic molecule
Emp. Form.:
C17H19N3O4
Mol. Mass.:
329.3505
SMILES:
Cc1cc(=O)oc2cc(NC(=O)C3CCCN3C(=O)CN)ccc12
: