Target
Dimer of Gag-Pol polyprotein [491-589,Q496K]
Ligand
BDBM12885
Substrate
HIV-1 Protease Substrate
Meas. Tech.
Enzyme Inhibition Assay
Ki
0.006±n/a nM
Citation
 Ali, AReddy, GSCao, HAnjum, SGNalam, MNSchiffer, CARana, TM Discovery of HIV-1 protease inhibitors with picomolar affinities incorporating N-aryl-oxazolidinone-5-carboxamides as novel P2 ligands. J Med Chem 49:7342-56 (2006)  
Target
Name:
Dimer of Gag-Pol polyprotein [491-589,Q496K]
Synonyms:
HIV-1 Protease | HIV-1 Protease (Q7K)
Type:
Protein Complex
Mol. Mass.:
Description:
Components:
This complex has 2 components.
Component 1
Name:
Gag-Pol polyprotein [491-589,Q496K]
Synonyms:
HIV-1 Protease chain A gag-pol
Type:
Enzyme Subunit
Mol. Mass.:
10807.22
Organism:
Human immunodeficiency virus type 1
Description:
P03369[491-589,Q496K]
Residue:
99
  
Component 2
Name:
Gag-Pol polyprotein [491-589,Q496K]
Synonyms:
HIV-1 Protease chain A gag-pol
Type:
Enzyme Subunit
Mol. Mass.:
10807.22
Organism:
Human immunodeficiency virus type 1
Description:
P03369[491-589,Q496K]
Residue:
99
  
Inhibitor
Name:
BDBM12885
Synonyms:
(5S)-N-[(1S,2R)-1-Benzyl-2-hydroxy-3-[isobutyl[(4-methoxy-phenyl)sulfonyl]amino]propyl]-2-oxo-3-[(3-trifluoromethyl)phenyl]-oxazolidine-5-carboxamide N-Aryl-oxazolidinone-5-carboxamide Analogue 21d
Type:
Small organic molecule
Emp. Form.:
C32H36F3N3O7S
Mol. Mass.:
663.704
SMILES:
COc1ccc(cc1)S(=O)(=O)N(CC(C)C)C[C@@H](O)[C@H](Cc1ccccc1)NC(=O)[C@@H]1CN(C(=O)O1)c1cccc(c1)C(F)(F)F
:
Substrate
Name:
HIV-1 Protease Substrate
Synonyms:
Type:
Peptide
Mol. Mass.:
4728.18
Organism:
Description:
Residue:
44