Target
Serine/threonine-protein kinase pim-1
Ligand
BDBM6760
Substrate
S6 Peptide Substrate
Meas. Tech.
Kinase Assay
pH
7.6±n/a
Temperature
303.15±n/a K
IC50
150±n/a nM
Citation
 Jacobs, MDBlack, JFuter, OSwenson, LHare, BFleming, MSaxena, K Pim-1 ligand-bound structures reveal the mechanism of serine/threonine kinase inhibition by LY294002. J Biol Chem 280:13728-34 (2005)  
Target
Name:
Serine/threonine-protein kinase pim-1
Synonyms:
PIM-1 Kinase PIM1_HUMAN Serine/threonine-protein kinase (PIM1) Serine/threonine-protein kinase PIM1 | Serine/threonine-protein kinase pim-1 (PIM1)
Type:
Protein
Mol. Mass.:
35681.82
Organism:
Homo sapiens (Human)
Description:
P11309
Residue:
313
  
Inhibitor
Name:
BDBM6760
Synonyms:
(+)-K-252a K-252a | methyl (15S,16R,18R)-16-hydroxy-15-methyl-3-oxo-28-oxa-4,14,19-triazaoctacyclo[12.11.2.1^{15,18}.0^{2,6}.0^{7,27}.0^{8,13}.0^{19,26}.0^{20,25}]octacosa-1(26),2(6),7(27),8(13),9,11,20(25),21,23-nonaene-16-carboxylate
Type:
Small organic molecule
Emp. Form.:
C27H21N3O5
Mol. Mass.:
467.4727
SMILES:
COC(=O)[C@@]1(O)C[C@H]2O[C@]1(C)n1c3ccccc3c3c4CNC(=O)c4c4c5ccccc5n2c4c13
:
Substrate
Name:
S6 Peptide Substrate
Synonyms:
Type:
Peptide
Mol. Mass.:
1118.34
Organism:
Description:
Residue:
9
RRRLSSLRA