Target
Nitric oxide synthase, inducible
Ligand
BDBM50446252
Substrate
Meas. Tech.
Inhibition Assay
Ki
2271±n/a nM
Citation
 Silverman, RBJing, Q 2-aminopyridine-based selective neuronal nitric oxide synthase inhibitors US Patent  US9732037 Publication Date 8/15/2017 
Target
Name:
Nitric oxide synthase, inducible
Synonyms:
HEP-NOS Inducible NO synthase NOS type II NOS2A Nitric oxide synthase, inducible (iNOS) | iNOS
Type:
Homodimer
Mol. Mass.:
131141.95
Organism:
Homo sapiens (Human)
Description:
P35228
Residue:
1153
  
Inhibitor
Name:
BDBM50446252
Synonyms:
CHEMBL3109186 | US9732037, Compound 6
Type:
Small organic molecule
Emp. Form.:
C19H27N5O2
Mol. Mass.:
357.45
SMILES:
Cc1cc(N)nc(COC[C@@H]2C[C@H](CN2)OCc2cc(C)cc(N)n2)c1
: