Target
Carbonic anhydrase 2
Ligand
BDBM13076
Substrate
BDBM11326
Meas. Tech.
Carbonic Anhydrase Enzyme Inhibition Assay
pH
7.4±n/a
Temperature
298.15±n/a K
IC50
5495.4±n/a nM
Citation
 Gruneberg, SStubbs, MTKlebe, G Successful virtual screening for novel inhibitors of human carbonic anhydrase: strategy and experimental confirmation. J Med Chem 45:3588-602 (2002)  
Target
Name:
Carbonic anhydrase 2
Synonyms:
CA-II CAC Carbonate dehydratase II Carbonic anhydrase 2 (CA-II) Carbonic anhydrase C Carbonic anhydrase II (CA-II) Carbonic anhydrase II (hCA II) | Carbonic anhydrase isoenzyme II (hCA II)
Type:
Enzyme
Mol. Mass.:
29250.71
Organism:
Homo sapiens (Human)
Description:
P00918
Residue:
260
  
Inhibitor
Name:
BDBM13076
Synonyms:
6-chloro-1,1-dioxo-3,4-dihydro-2H-1,2,4-benzothiadiazine-7-sulfonamide Dichlothiazide Hydrochlorothiazide JFD00715 cid_3639
Type:
Small organic molecule
Emp. Form.:
C7H8ClN3O4S2
Mol. Mass.:
297.739
SMILES:
NS(=O)(=O)c1cc2c(NCNS2(=O)=O)cc1Cl
:
Substrate
Name:
BDBM11326
Synonyms:
4-nitrophenyl acetate | p-Nitrophenyl Acetate
Type:
Small organic molecule
Emp. Form.:
C8H7NO4
Mol. Mass.:
181.1455
SMILES:
CC(=O)Oc1ccc(cc1)[N+]([O-])=O
: