Target
E3 ubiquitin-protein ligase XIAP [241-356]
Ligand
BDBM13151
Substrate
Smac-derived peptide
Meas. Tech.
Fluorescence Polarization Competitive Binding Assay
pH
7.5±n/a
Temperature
295.15±n/a K
Ki
28±20 nM
Citation
 Sun, HNikolovska-Coleska, ZChen, JYang, CYTomita, YPan, HYoshioka, YKrajewski, KRoller, PPWang, S Structure-based design, synthesis and biochemical testing of novel and potent Smac peptido-mimetics. Bioorg Med Chem Lett 15:793-7 (2005)  
Target
Name:
E3 ubiquitin-protein ligase XIAP [241-356]
Synonyms:
API3 BIRC4 E3 ubiquitin-protein ligase XIAP BIR-3 IAP3 X-linked inhibitor of apoptosis protein BIR3 domain (XIAP BIR-3) XIAP-BIR3 baculovirus IAP repeat 3 (BIR3) domain of XIAP
Type:
Protein Binding Domain
Mol. Mass.:
13276.62
Organism:
Homo sapiens (Human)
Description:
BIR3 of XIAP: RESIDUES 241-356.
Residue:
116
  
Inhibitor
Name:
BDBM13151
Synonyms:
(2S)-1-[(2S)-2-[(2S)-2-aminopropanamido]-3-methylbutanoyl]-N-(diphenylmethyl)pyrrolidine-2-carboxamide | Smac peptido-mimetic 6i
Type:
Small organic molecule
Emp. Form.:
C26H34N4O3
Mol. Mass.:
450.5732
SMILES:
CC(C)[C@H](NC(=O)[C@H](C)N)C(=O)N1CCC[C@H]1C(=O)NC(c1ccccc1)c1ccccc1
:
Substrate
Name:
Smac-derived peptide
Synonyms:
Type:
Peptide
Mol. Mass.:
619.76
Organism:
Description:
5-carboxyfluorescein was coupled to the lysine side chain of the mutated Smac peptide.
Residue:
5
ARPFK