Target
RAF proto-oncogene serine/threonine-protein kinase
Ligand
BDBM200517
Substrate
Meas. Tech.
TBD
IC50
0.150±n/a nM
Citation
 Zhou, CZhang, G Fused tricyclic amide compounds as multiple kinase inhibitors US Patent  US9670231 Publication Date 6/6/2017 
Target
Name:
RAF proto-oncogene serine/threonine-protein kinase
Synonyms:
C-Raf Protein Kinase RAF RAF1 Raf-1 Serine/threonine-protein kinase C-Raf | cRaf
Type:
Serine/threonine-protein kinase
Mol. Mass.:
73082.52
Organism:
Homo sapiens (Human)
Description:
P04049
Residue:
648
  
Inhibitor
Name:
BDBM200517
Synonyms:
US9670231, 1.39
Type:
Small organic molecule
Emp. Form.:
C24H18FN3O4
Mol. Mass.:
431.4158
SMILES:
Fc1cccc(c1)C(=O)N[C@@H]1[C@H]2Oc3ccc(Oc4ccnc5NC(=O)CCc45)cc3[C@@H]12
: