Target
Intermediate conductance calcium-activated potassium channel protein 4
Ligand
BDBM200966
Substrate
Meas. Tech.
KCa3.1 Assay
IC50
60±0 nM
Citation
 Burke, MJMcKibben, BTschantz, MA Fused thiazin-3-ones as KCA3.1 inhibitors US Patent  US9533999 Publication Date 1/3/2017 
Target
Name:
Intermediate conductance calcium-activated potassium channel protein 4
Synonyms:
IK1 KCA4 KCNN4_HUMAN SK4
Type:
PROTEIN
Mol. Mass.:
47723.22
Organism:
Homo sapiens (Human)
Description:
ChEMBL_1361891
Residue:
427
  
Inhibitor
Name:
BDBM200966
Synonyms:
US9533999, ii-17
Type:
Small organic molecule
Emp. Form.:
C13H8F4N2O2S2
Mol. Mass.:
364.338
SMILES:
Fc1ccc(CN2c3scnc3SCC2=O)cc1OC(F)(F)F
: