Target
Nuclear receptor ROR-gamma
Ligand
BDBM338458
Substrate
Meas. Tech.
Binding Assay
IC50
3.00±n/a nM
Citation
 Fauber, BGobbi, ARene, Ovan Niel, MBGancia, EGaines, SLadduwahetty, TVesey, DWard, SWinship, P Aryl sultam derivatives as RORc modulators US Patent  US9751873 Publication Date 9/5/2017 
Target
Name:
Nuclear receptor ROR-gamma
Synonyms:
NR1F3 Nuclear receptor ROR-gamma (RORC) RAR-related orphan receptor C (RORc) RORG RZRG Retinoid-related orphan receptor-gamma (RORc)
Type:
Enzyme Catalytic Domain
Mol. Mass.:
58218.40
Organism:
Homo sapiens (Human)
Description:
P51449
Residue:
518
  
Inhibitor
Name:
BDBM338458
Synonyms:
(3S,6R)-2-[[2,5-difluoro-4-[4- (1,2,4-triazol-4-yl)-1- piperidyl]phenyl]methyl]-3-ethyl- 6-phenyl-thiazinane 1,1-dioxide | US9751873, Example 145
Type:
Small organic molecule
Emp. Form.:
C26H35F2N5O2S
Mol. Mass.:
519.65
SMILES:
CC[C@@H](CC[C@H](c1ccccc1)S(=O)=O)NCc1cc(F)c(cc1F)N1CCC(CC1)N(C=N)C=N
: