Target
Geranylgeranyl transferase type-1 subunit beta [A2V]/Protein farnesyltransferase/geranylgeranyltransferase type-1 subunit alpha
Ligand
BDBM14009
Substrate
Biotinylated Peptide Substrate
Meas. Tech.
In Vitro FTase Inhibition Assay
IC50
650±n/a nM
Citation
 Bell, IMGallicchio, SNAbrams, MBeese, LSBeshore, DCBhimnathwala, HBogusky, MJBuser, CACulberson, JCDavide, JEllis-Hutchings, MFernandes, CGibbs, JBGraham, SLHamilton, KAHartman, GDHeimbrook, DCHomnick, CFHuber, HEHuff, JRKassahun, KKoblan, KSKohl, NELobell, RBLynch, JJRobinson, RRodrigues, ADTaylor, JSWalsh, ESWilliams, TMZartman, CB 3-Aminopyrrolidinone farnesyltransferase inhibitors: design of macrocyclic compounds with improved pharmacokinetics and excellent cell potency. J Med Chem 45:2388-409 (2002)  
Target
Name:
Geranylgeranyl transferase type-1 subunit beta [A2V]/Protein farnesyltransferase/geranylgeranyltransferase type-1 subunit alpha
Synonyms:
Geranylgeranyl Transferase (GGTase-I)
Type:
Protein Complex
Mol. Mass.:
Description:
To express recombinant enzyme in E. coli, the cloned human alpha and beta subunits were co-expressed from a plasmid, in which their expression was translationally coupled.
Components:
This complex has 2 components.
Component 1
Name:
Geranylgeranyl transferase type-1 subunit beta [A2V]
Synonyms:
GGTase-I-beta Geranylgeranyl transferase type-1 subunit beta PGTB1_HUMAN
Type:
Enzyme Subunit
Mol. Mass.:
42397.89
Organism:
Homo sapiens (Human)
Description:
Geranylgeranyl transferase type-1 subunit beta.
Residue:
377
  
Component 2
Name:
Protein farnesyltransferase/geranylgeranyltransferase type-1 subunit alpha
Synonyms:
CAAX farnesyltransferase alpha subunit FNTA_HUMAN FTase-alpha Geranylgeranyl Transferase (GGTase-I) Chain A Protein Farnesyltransferase (PFT) Chain A Protein farnesyltransferase Protein farnesyltransferase/geranylgeranyltransferase type I alpha subunit | Ras proteins prenyltransferase alpha
Type:
Enzyme
Mol. Mass.:
44392.46
Organism:
Homo sapiens (Human)
Description:
Recombinant human FTase.
Residue:
379
  
Inhibitor
Name:
BDBM14009
Synonyms:
(20S)-19,20,21,22-Tetrahydro-19-oxo-5H-18,20-ethano-12,14-etheno-6,10-metheno-18H-benz[d]-imidazo[4,3-k][1,6,9,12]oxatriazacyclooctadecosine-9-caronitrile CHEMBL53821 | Macrocyclic 3-Aminopyrrolidinone analog 49
Type:
Small organic molecule
Emp. Form.:
C26H21N5O2
Mol. Mass.:
435.4772
SMILES:
O=C1[C@@H]2CCN1c1cccc3ccc(Oc4cc(Cn5cncc5CN2)ccc4C#N)cc13
:
Substrate
Name:
Biotinylated Peptide Substrate
Synonyms:
biotinylated peptide that represents the C-terminus of the K4B-Ras protein
Type:
Peptide
Mol. Mass.:
2461.17
Organism:
Description:
100 nM [3H]GGPP as co-substrate.
Residue:
21