Target
Rho-associated protein kinase 1
Ligand
BDBM14045
Substrate
Biotinylated Peptide Substrate
Meas. Tech.
ROCK 1 Kinase Activity Assay
pH
7.4±n/a
Temperature
295.15±n/a K
IC50
<1±n/a nM
Citation
 Stavenger, RACui, HDowdell, SEFranz, RGGaitanopoulos, DEGoodman, KBHilfiker, MAIvy, RLLeber, JDMarino, JPOh, HJViet, AQXu, WYe, GZhang, DZhao, YJolivette, LJHead, MSSemus, SFElkins, PAKirkpatrick, RBDul, EKhandekar, SSYi, TJung, DKWright, LLSmith, GKBehm, DJDoe, CPBentley, RChen, ZXHu, ELee, D Discovery of aminofurazan-azabenzimidazoles as inhibitors of Rho-kinase with high kinase selectivity and antihypertensive activity. J Med Chem 50:2-5 (2007)  
Target
Name:
Rho-associated protein kinase 1
Synonyms:
ROCK-I ROCK1_HUMAN Rho-associated protein kinase Rho-associated, coiled-coil-containing protein kinase 1 Rho-kinase (ROCK I) p160 ROCK-1 | p160ROCK
Type:
Serine/threonine-protein kinase
Mol. Mass.:
158156.77
Organism:
Homo sapiens (Human)
Description:
Q13464
Residue:
1354
  
Inhibitor
Name:
BDBM14045
Synonyms:
Aminofurazanyl-azabenzimidazole 6l | N-(3-{[2-(4-amino-1,2,5-oxadiazol-3-yl)-1-ethyl-1H-imidazo[4,5-c]pyridin-6-yl]oxy}phenyl)-4-(morpholin-4-ylmethyl)benzamide
Type:
Small organic molecule
Emp. Form.:
C28H28N8O4
Mol. Mass.:
540.5731
SMILES:
CCn1c(nc2cnc(Oc3cccc(NC(=O)c4ccc(CN5CCOCC5)cc4)c3)cc12)-c1nonc1N
:
Substrate
Name:
Biotinylated Peptide Substrate
Synonyms:
Type:
Peptide
Mol. Mass.:
2323.73
Organism:
Description:
Residue:
20