Target
Serine protease 1
Ligand
BDBM14137
Substrate
BDBM14141
Meas. Tech.
Enzyme Inhibition Assay
Ki
16±n/a nM
Citation
 Costanzo, MJAlmond, HRHecker, LRSchott, MRYabut, SCZhang, HCAndrade-Gordon, PCorcoran, TWGiardino, ECKauffman, JALewis, JMde Garavilla, LHaertlein, BJMaryanoff, BE In-depth study of tripeptide-based alpha-ketoheterocycles as inhibitors of thrombin. Effective utilization of the S1' subsite and its implications to structure-based drug design. J Med Chem 48:1984-2008 (2005)  
Target
Name:
Serine protease 1
Synonyms:
Beta-Trypsin PRSS1 TRY1 TRYP1 Trypsin I
Type:
Enzyme
Mol. Mass.:
25790.52
Organism:
Bos taurus (bovine)
Description:
P00760
Residue:
246
  
Inhibitor
Name:
BDBM14137
Synonyms:
2-ketobenzothiazole 75 | methyl (3S)-4-[(2S)-2-{[(2S)-1-(1,3-benzothiazol-2-yl)-5-carbamimidamido-1-oxopentan-2-yl]carbamoyl}pyrrolidin-1-yl]-4-oxo-3-(2-propylpentanamido)butanoate
Type:
Small organic molecule
Emp. Form.:
C31H45N7O6S
Mol. Mass.:
643.797
SMILES:
[#6]-[#6]-[#6]-[#6](-[#6]-[#6]-[#6])-[#6](=O)-[#7]-[#6@@H](-[#6]-[#6](=O)-[#8]-[#6])-[#6](=O)-[#7]-1-[#6]-[#6]-[#6]-[#6@H]-1-[#6](=O)-[#7]-[#6@@H](-[#6]-[#6]-[#6]\[#7]=[#6](\[#7])-[#7])-[#6](=O)-c1nc2ccccc2s1
:
Substrate
Name:
BDBM14141
Synonyms:
Cbo-Gly-D-Ala-Arg-pNA.AcOH benzyl N-({[(1R)-1-{[(1S)-4-carbamimidamido-1-[(4-nitrophenyl)carbamoyl]butyl]carbamoyl}ethyl]carbamoyl}methyl)carbamate; acetic acid | carbobenzoxy-glycyl-D-alanine-p-nitroanilide-acetate
Type:
Emp. Form.:
Mol. Mass.:
SMILES:
: