Target
Tyrosine-protein kinase BTK
Ligand
BDBM340121
Substrate
Meas. Tech.
Btk Enzyme Activity
EC50
<10.00±n/a nM
Citation
 Barf, TAJans, CGde Man, APOubrie, AARaaijmakers, HCRewinkel, JBSterrenburg, JGWijkmans, JC 4-imidazopyridazin-1-yl-benzamides as Btk inhibitors US Patent  US9758524 Publication Date 9/12/2017 
Target
Name:
Tyrosine-protein kinase BTK
Synonyms:
AGMX1 Agammaglobulinaemia tyrosine kinase B cell progenitor kinase BPK BTK_HUMAN Tyrosine Kinase BTK Tyrosine-protein kinase BTK (BTK)
Type:
Enzyme
Mol. Mass.:
76289.95
Organism:
Homo sapiens (Human)
Description:
Q06187
Residue:
659
  
Inhibitor
Name:
BDBM340121
Synonyms:
US10239883, Example 8 US9758524, Example 8
Type:
Small organic molecule
Emp. Form.:
C27H25N7O2
Mol. Mass.:
479.5331
SMILES:
CC#CC(=O)N1CCC[C@H]1c1nc(-c2ccc(cc2)C(=O)Nc2cc(C)ccn2)c2c(N)nccn12
: