Target
Tyrosine-protein kinase Fyn
Ligand
BDBM50175583
Substrate
Meas. Tech.
FynT Enzyme Activity
EC50
>1000±n/a nM
Citation
 Barf, TAJans, CGde Man, APOubrie, AARaaijmakers, HCRewinkel, JBSterrenburg, JGWijkmans, JC 4-imidazopyridazin-1-yl-benzamides as Btk inhibitors US Patent  US9758524 Publication Date 9/12/2017 
Target
Name:
Tyrosine-protein kinase Fyn
Synonyms:
FYN Proto-oncogene Syn SLK Src-like kinase | p59-Fyn
Type:
Enzyme
Mol. Mass.:
60762.21
Organism:
Homo sapiens (Human)
Description:
P06241
Residue:
537
  
Inhibitor
Name:
BDBM50175583
Synonyms:
ACP-196 US10239883, Example 6 US10919899, ACP-196 US11420975, Acalabrutinlb | US9758524, Example 6
Type:
Small organic molecule
Emp. Form.:
C26H23N7O2
Mol. Mass.:
465.5065
SMILES:
[H][C@]1(CCCN1C(=O)C#CC)c1nc(-c2ccc(cc2)C(=O)Nc2ccccn2)c2c(N)nccn12
: