Target
Tissue-type plasminogen activator
Ligand
BDBM14157
Substrate
BDBM12774
Meas. Tech.
Enzyme Assay and Determination of the Inhibition Constants
Ki
190±n/a nM
Citation
 Katz, BASprengeler, PALuong, CVerner, EElrod, KKirtley, MJanc, JSpencer, JRBreitenbucher, JGHui, HMcGee, DAllen, DMartelli, AMackman, RL Engineering inhibitors highly selective for the S1 sites of Ser190 trypsin-like serine protease drug targets. Chem Biol 8:1107-21 (2001)  
Target
Name:
Tissue-type plasminogen activator
Synonyms:
Alteplase Reteplase Thrombin receptor protein Tissue-type plasminogen activator (tPA) t-PA t-plasminogen activator
Type:
Enzyme
Mol. Mass.:
62931.08
Organism:
Homo sapiens (Human)
Description:
Residue:
562
  
Inhibitor
Name:
BDBM14157
Synonyms:
APC-10605 N-(4-carbamimidoylphenyl)-2-hydroxy-3-iodo-5-methylbenzamide
Type:
Small organic molecule
Emp. Form.:
C15H14IN3O2
Mol. Mass.:
395.195
SMILES:
Cc1cc(I)c(O)c(c1)C(=O)Nc1ccc(cc1)C(N)=N
:
Substrate
Name:
BDBM12774
Synonyms:
(2S)-5-carbamimidamido-2-{2-[(2R)-3-(4-hydroxycyclohexyl)-2-methanesulfonamidopropanamido]acetamido}-N-(4-nitrophenyl)pentanamide; acetic acid Factor IX Chromogenic Substrate Methylsulfonyl-D-hexahydrotyrosyl-glycyl-arginine-4-nitroanilide Spectrozyme tPA | tPA/Trypsin Substrate
Type:
Small organic molecule
Emp. Form.:
C24H38N8O8S
Mol. Mass.:
598.672
SMILES:
CS(=O)(=O)NC(CC1CCC(O)CC1)C(=O)NCC(=O)NC(CCC\[NH+]=C(\N)[NH-])C(=O)Nc1ccc(cc1)[N+]([O-])=O
: