Target
Phosphatidylinositol 3-kinase regulatory subunit alpha
Ligand
BDBM340312
Substrate
Meas. Tech.
Biochemical Assay
Ki
0.020±n/a nM
Citation
 Chen, PCheng, HGallego, GMJalaie, MKath, JCOrr, STPairish, MA Pyrimidine derivatives US Patent  US9758538 Publication Date 9/12/2017 
Target
Name:
Phosphatidylinositol 3-kinase regulatory subunit alpha
Synonyms:
GRB1 PI3-kinase class I PI3-kinase p85-alpha subunit PI3-kinase subunit p85-alpha PIK3CG/PIK3R1 Phosphatidylinositol 3-kinase 85 kDa regulatory subunit alpha (PI3K alpha) Phosphatidylinositol 3-kinase regulatory subunit alpha (PIK3R1) Phosphatidylinositol 3-kinase regulatory subunit alpha isoform 1 (PI3 Kinase alpha) Phosphatidylinositol 4,5-bisphosphate 3-kinase catalytic subunit alpha isoform (PI3Kalpha) PtdIns-3-kinase p85-alpha p85 alpha
Type:
Protein
Mol. Mass.:
83592.82
Organism:
Homo sapiens (Human)
Description:
P27986
Residue:
724
  
Inhibitor
Name:
BDBM340312
Synonyms:
(Scheme A): Preparation of [(3S)-3-{[2′-amino-5-fluoro-2-(morpholin-4-yl)-4,5′-bipyrimidin-6-yl]amino}-3-(hydroxymethyl)pyrrolidin-1-yl](1-fluorocyclopropyl)methanone | US9758538, Example 1
Type:
Small organic molecule
Emp. Form.:
C21H26F2N8O3
Mol. Mass.:
476.4797
SMILES:
Nc1ncc(cn1)-c1nc(nc(N[C@@]2(CO)CCN(C2)C(=O)C2(F)CC2)c1F)N1CCOCC1
: