Target
Calcium-dependent protein kinase 1
Ligand
BDBM50298225
Substrate
Meas. Tech.
Biological Assay
IC50
144±n/a nM
Citation
 Van Voorhis, WCHol, WGLarson, ETMaly, DJMerritt, EOjo, KK Compositions and methods for treating toxoplasmosis, cryptosporidiosis, and other apicomplexan protozoan related diseases US Patent  US9765037 Publication Date 9/19/2017 
Target
Name:
Calcium-dependent protein kinase 1
Synonyms:
Calcium-dependent protein kinase 1 (CDPK1)
Type:
Protein
Mol. Mass.:
76617.33
Organism:
Cryptosporidium parvum
Description:
Q6S4W0
Residue:
677
  
Inhibitor
Name:
BDBM50298225
Synonyms:
CHEMBL2069955 NM-PP1 US11247972, Compound 5d | US9765037, Compound 5d
Type:
Small organic molecule
Emp. Form.:
C20H21N5
Mol. Mass.:
331.4142
SMILES:
CC(C)(C)n1nc(Cc2cccc3ccccc23)c2c(N)ncnc12
: