Target
Prothrombin
Ligand
BDBM772
Substrate
BDBM12679
Meas. Tech.
Enzyme Assay and Determination of the Inhibition Constants
pH
7.4±n/a
Temperature
295.15±n/a K
Ki
320000±25000 nM
Citation
 Katz, BAMackman, RLuong, CRadika, KMartelli, ASprengeler, PAWang, JChan, HWong, L Structural basis for selectivity of a small molecule, S1-binding, submicromolar inhibitor of urokinase-type plasminogen activator. Chem Biol 7:299-312 (2000)  
Target
Name:
Prothrombin
Synonyms:
Activation peptide fragment 1 Coagulation factor II Prothrombin precursor Thrombin heavy chain | Thrombin light chain
Type:
Protein
Mol. Mass.:
70029.57
Organism:
Homo sapiens (Human)
Description:
P00734
Residue:
622
  
Inhibitor
Name:
BDBM772
Synonyms:
Benzamidine [amino(phenyl)methylidene]azanium benzamidinium chloride
Type:
Emp. Form.:
C7H9N2
Mol. Mass.:
121.1592
SMILES:
NC(=[NH2+])c1ccccc1
:
Substrate
Name:
BDBM12679
Synonyms:
BDBM13790 Chromogenic Substrate
Type:
Small organic molecule
Emp. Form.:
C26H34N6O7S
Mol. Mass.:
574.649
SMILES:
Cc1ccc(cc1)S(=O)(=O)NCC(=O)N1CCCC1C(=O)NC(CCCCN)C(=O)Nc1ccc(cc1)[N+]([O-])=O
: