Target
Tyrosine-protein phosphatase non-receptor type 1 [1-298]
Ligand
BDBM14248
Substrate
BDBM13466
Meas. Tech.
Enzymatic Assay
pH
7±n/a
Temperature
295.15±n/a K
Ki
3300±n/a nM
Citation
 Wan, ZKLee, JXu, WErbe, DVJoseph-McCarthy, DFollows, BCZhang, YL Monocyclic thiophenes as protein tyrosine phosphatase 1B inhibitors: capturing interactions with Asp48. Bioorg Med Chem Lett 16:4941-5 (2006)  
Target
Name:
Tyrosine-protein phosphatase non-receptor type 1 [1-298]
Synonyms:
PTN1_HUMAN PTP1B PTPase 1B Tyrosine-protein phosphatase, non-receptor type 1
Type:
Enzyme
Mol. Mass.:
34670.65
Organism:
Homo sapiens (Human)
Description:
The catalytic domain of PTP 1B (residues 1-298) was expressed and purified from E. coli.
Residue:
298
  
Inhibitor
Name:
BDBM14248
Synonyms:
4-bromo-3-(carboxymethoxy)-5-(naphthalen-2-yl)thiophene-2-carboxylic acid | Monocyclic thiophene analog 14
Type:
Small organic molecule
Emp. Form.:
C17H11BrO5S
Mol. Mass.:
407.235
SMILES:
OC(=O)COc1c(Br)c(sc1C(O)=O)-c1ccc2ccccc2c1
:
Substrate
Name:
BDBM13466
Synonyms:
4-Nitrophenyl phosphate disodium salt hexahydrate disodium (4-nitrophenyl) phosphate | para-nitrophenyl phosphate (pNPP)
Type:
Small organic molecule
Emp. Form.:
C6H4NO6P
Mol. Mass.:
217.0739
SMILES:
[O-][N+](=O)c1ccc(O[P+]([O-])([O-])[O-])cc1
: