Target
Tyrosine-protein phosphatase non-receptor type 2
Ligand
BDBM14267
Substrate
BDBM13466
Meas. Tech.
Enzymatic Assay
Temperature
298.15±n/a K
Ki
180±n/a nM
Comments
extracted
Citation
 Wan, ZKLee, JXu, WErbe, DVJoseph-McCarthy, DFollows, BCZhang, YL Monocyclic thiophenes as protein tyrosine phosphatase 1B inhibitors: capturing interactions with Asp48. Bioorg Med Chem Lett 16:4941-5 (2006)  
Target
Name:
Tyrosine-protein phosphatase non-receptor type 2
Synonyms:
PTN2_HUMAN PTPT T-cell protein-tyrosine phosphatase TCPTP Tyrosine-protein phosphatase non-receptor type 2 (TC-PTP)
Type:
Protein
Mol. Mass.:
48481.80
Organism:
Homo sapiens (Human)
Description:
P17706
Residue:
415
  
Inhibitor
Name:
BDBM14267
Synonyms:
4-bromo-3-(carboxymethoxy)-5-[4-(2-formamidoacetic acid)phenyl]thiophene-2-carboxylic acid | Monocyclic thiophene analog 36
Type:
Small organic molecule
Emp. Form.:
C16H12BrNO8S
Mol. Mass.:
458.237
SMILES:
OC(=O)COc1c(Br)c(sc1C(O)=O)-c1ccc(NC(=O)CC(O)=O)cc1
:
Substrate
Name:
BDBM13466
Synonyms:
4-Nitrophenyl phosphate disodium salt hexahydrate disodium (4-nitrophenyl) phosphate | para-nitrophenyl phosphate (pNPP)
Type:
Small organic molecule
Emp. Form.:
C6H4NO6P
Mol. Mass.:
217.0739
SMILES:
[O-][N+](=O)c1ccc(O[P+]([O-])([O-])[O-])cc1
: