Target
Phosphatidylinositol 4,5-bisphosphate 3-kinase catalytic subunit delta isoform
Ligand
BDBM341173
Substrate
Meas. Tech.
TR-FRET assay
IC50
0.300±n/a nM
Citation
 Evarts, JKaplan, JKim, MNaduthambi, DPatel, LPerreault, SPhillips, GPurvis, II, LJStevens, KLTreiberg, JA Phosphatidylinositol 3-kinase inhibitors US Patent  US9765060 Publication Date 9/19/2017 
Target
Name:
Phosphatidylinositol 4,5-bisphosphate 3-kinase catalytic subunit delta isoform
Synonyms:
PI3-kinase p110 subunit delta PI3-kinase subunit p110-delta PIK3CD Phosphatidylinositol 4,5-biphosphate 3-kinase catalytic subunit delta (PIK3CD) Phosphatidylinositol 4,5-bisphosphate 3-kinase 110 kDa catalytic subunit delta (PI3K delta) Phosphatidylinositol 4,5-bisphosphate 3-kinase catalytic subunit delta (PI3Kdelta) Phosphatidylinositol 4,5-bisphosphate 3-kinase catalytic subunit delta isoform (PI3K delta) Phosphatidylinositol 4,5-bisphosphate 3-kinase catalytic subunit delta isoform (PI3K-delta) Phosphatidylinositol 4,5-bisphosphate 3-kinase catalytic subunit delta isoform (PI3Kdelta)
Type:
Enzyme Subunit
Mol. Mass.:
119489.41
Organism:
Homo sapiens (Human)
Description:
O00329
Residue:
1044
  
Inhibitor
Name:
BDBM341173
Synonyms:
(S)-2,4-diamino-6-(((5-chloro-4-oxo-3-phenyl-3,4-dihydroquinazoline-2-yl)(phenyl)methyl)amino)pyrimidine-5-carbonitrile | US9765060, Compound 3a
Type:
Small organic molecule
Emp. Form.:
C26H19ClN8O
Mol. Mass.:
494.935
SMILES:
Nc1nc(N)c(C#N)c(N[C@@H](c2ccccc2)c2nc3cccc(Cl)c3c(=O)n2-c2ccccc2)n1
: