Target
Cyclin-A2/Cyclin-dependent kinase 2
Ligand
BDBM253942
Substrate
Meas. Tech.
Caliper Assay
IC50
265±n/a nM
Citation
 Strum, JCBisi, JERoberts, PJTavares, FX HSPC-sparing treatments for RB-positive abnormal cellular proliferation US Patent  US9527857 Publication Date 12/27/2016 
Target
Name:
Cyclin-A2/Cyclin-dependent kinase 2
Synonyms:
CDK2-CyclinA CDK2/Cyclin A Cyclin A2/dependent kinase 2 Cyclin-Dependent Kinase 2 (CDK2A)
Type:
Protein Complex
Mol. Mass.:
Description:
Cdk2/Cyclin A kinase was purified from insect cells coinfected with Cyclin A/Cdk2 baculovirus.
Components:
This complex has 2 components.
Component 1
Name:
Cyclin-dependent kinase 2
Synonyms:
CDK2 CDK2_HUMAN Cell division protein kinase 2 Protein cereblon/Cyclin-dependent kinase 2 | p33 protein kinase
Type:
Enzyme Subunit
Mol. Mass.:
33938.17
Organism:
Homo sapiens (Human)
Description:
P24941
Residue:
298
  
Component 2
Name:
Cyclin-A2
Synonyms:
CCN1 CCNA1 CCNA2_HUMAN Cyclin-A
Type:
Enzyme Subunit
Mol. Mass.:
48550.19
Organism:
Homo sapiens (Human)
Description:
P20248
Residue:
432
  
Inhibitor
Name:
BDBM253942
Synonyms:
US9464092, HH | US9527857, HH
Type:
Small organic molecule
Emp. Form.:
C27H34N8O
Mol. Mass.:
486.6119
SMILES:
O=C1NCC2(CCCCC2)n2c1cc1cnc(Nc3ccc(cn3)N3CCN(CC4CC4)CC3)nc21
: