Target
Mast/stem cell growth factor receptor Kit
Ligand
BDBM342264
Substrate
Meas. Tech.
Biochemical Assay
Ki
500±n/a nM
Citation
 Lin, JPham, PBuell, JSpevak, W Compounds and methods for kinase modulation, and indications therefor US Patent  US9771369 Publication Date 9/26/2017 
Target
Name:
Mast/stem cell growth factor receptor Kit
Synonyms:
CD117 antigen KIT Mast/stem cell growth factor receptor Kit (cKIT) Proto-oncogene tyrosine-protein kinase Kit Stem cell growth factor receptor Tyrosine-protein kinase Kit c-kit v-kit Hardy-Zuckerman 4 feline sarcoma viral oncogene homolog
Type:
Protein
Mol. Mass.:
109869.37
Organism:
Homo sapiens (Human)
Description:
P10721
Residue:
976
  
Inhibitor
Name:
BDBM342264
Synonyms:
4-[4-[5-(3-ethoxy-4-methyl-phenyl)-4- methyl-1H-imidazol-2-yl]-1-piperidyl]- 6-(2-methoxy-4-pyridyl)-7H- pyrrolo[2,3-d]pyrimidine | US9771369, Compound P-3096
Type:
Small organic molecule
Emp. Form.:
C30H33N7O2
Mol. Mass.:
523.6287
SMILES:
CCOc1cc(ccc1C)-c1[nH]c(nc1C)C1CCN(CC1)c1ncnc2[nH]c(cc12)-c1ccnc(OC)c1
: