Target
Tyrosine-protein kinase JAK1 [850-1154]
Ligand
BDBM348915
Substrate
Meas. Tech.
JAK1 Inhibition Assay
IC50
<100±n/a nM
Citation
 Menet, CJVan Rompaey, LJFletcher, SRBlanc, JJouannigot, NHodges, AJSmits, KK Compounds useful for the treatment of degenerative and inflammatory diseases US Patent  US10206907 Publication Date 2/19/2019 
Target
Name:
Tyrosine-protein kinase JAK1 [850-1154]
Synonyms:
JAK1 JAK1A JAK1_HUMAN
Type:
Enzyme Catalytic Domain
Mol. Mass.:
34949.64
Organism:
Homo sapiens (Human)
Description:
P23458[850-1154]
Residue:
305
  
Inhibitor
Name:
BDBM348915
Synonyms:
4-(2- (cyclopropanecarboxamido)- [1,2,4]triazolo[1,5-a]pyridin-5- yl)-N-(3- fluorobenzyl)benzamide | US10206907, Compound 29
Type:
Small organic molecule
Emp. Form.:
C24H20FN5O2
Mol. Mass.:
429.4463
SMILES:
Fc1cccc(CNC(=O)c2ccc(cc2)-c2cccc3nc(NC(=O)C4CC4)nn23)c1
: