Target
Tyrosine-protein kinase JAK1
Ligand
BDBM127657
Substrate
Meas. Tech.
Jak1 Inhibition Assay
IC50
>1000±n/a nM
Citation
 Allen, SAndrews, SWCondroski, KRHaas, JHuang, LJiang, YKercher, TSeo, J Substituted pyrazolo[1,5-a]pyrimidine compounds as Trk kinase inhibitors US Patent  US9782415 Publication Date 10/10/2017 
Target
Name:
Tyrosine-protein kinase JAK1
Synonyms:
JAK-1 JAK1A JAK1_HUMAN Janus kinase 1 (JAK1) | Janus kinase 1 JAK1
Type:
Protein
Mol. Mass.:
133293.73
Organism:
Homo sapiens (Human)
Description:
P23458
Residue:
1154
  
Inhibitor
Name:
BDBM127657
Synonyms:
US10251889, Example 30 US8791123, 30 US9796724, Example 30
Type:
Small organic molecule
Emp. Form.:
C17H15F2N5O
Mol. Mass.:
343.3307
SMILES:
NC(=O)c1cnn2ccc(nc12)N1CCC[C@@H]1c1cc(F)ccc1F
: