Target
Nitric oxide synthase, brain
Ligand
BDBM344408
Substrate
Meas. Tech.
Enzyme Assay
Ki
21.0±n/a nM
Citation
 Silverman, RBCinelli, MAPensa, AV 2-aminoquinoline-based compounds for potent and selective neuronal nitric oxide synthase inhibition US Patent  US9783500 Publication Date 10/10/2017 
Target
Name:
Nitric oxide synthase, brain
Synonyms:
Constitutive NOS NC-NOS NOS type I nNOS NOS1_HUMAN Neuronal nitric oxide synthase Nitric oxide synthase, neuronal (nNOS) bNOS | nNOS
Type:
Homodimer
Mol. Mass.:
160985.98
Organism:
Homo sapiens (Human)
Description:
P29475
Residue:
1434
  
Inhibitor
Name:
BDBM344408
Synonyms:
US9783500, Compound 10 | US9783500, Compound 4
Type:
Small organic molecule
Emp. Form.:
C19H21N3O
Mol. Mass.:
307.3895
SMILES:
CN(C)Cc1cccc(OCc2ccc3ccc(N)nc3c2)c1
: