Target
Nitric oxide synthase, brain
Ligand
BDBM50330882
Substrate
Meas. Tech.
Enzyme Assay
Ki
318±n/a nM
Citation
 Silverman, RBCinelli, MAPensa, AV 2-aminoquinoline-based compounds for potent and selective neuronal nitric oxide synthase inhibition US Patent  US9783500 Publication Date 10/10/2017 
Target
Name:
Nitric oxide synthase, brain
Synonyms:
Constitutive NOS NC-NOS NOS type I nNOS NOS1_HUMAN Neuronal nitric oxide synthase Nitric oxide synthase, neuronal (nNOS) bNOS | nNOS
Type:
Homodimer
Mol. Mass.:
160985.98
Organism:
Homo sapiens (Human)
Description:
P29475
Residue:
1434
  
Inhibitor
Name:
BDBM50330882
Synonyms:
CHEMBL1277951 N1-((3R,4R)-4-((6-aminopyridin-2-yl)methyl)pyrrolidin-3-yl)-N2-(4-fluorobenzyl)ethane-1,2-diamine tetrahydrochloride US9212144, 1 | US9783500, Compound 2
Type:
Small organic molecule
Emp. Form.:
C21H30FN5
Mol. Mass.:
371.4948
SMILES:
Cc1cc(N)nc(C[C@@H]2CNC[C@@H]2NCCNCCc2cccc(F)c2)c1
: