Target
Epidermal growth factor receptor
Ligand
BDBM50391089
Substrate
Meas. Tech.
Kinase Assay (EGFR)(T790M)
IC50
>1000±n/a nM
Citation
 Hu, SLiu, XBai, JLong, W Protein tyrosine kinase modulators and methods of use US Patent  US9783524 Publication Date 10/10/2017 
Target
Name:
Epidermal growth factor receptor
Synonyms:
EGF Receptor Substrate EGFR_HUMAN ERBB1 Epidermal Growth Factor Receptor erbB-1 Epidermal growth factor receptor (EGFR) HER1 Proto-oncogene c-ErbB-1 Tyrosine-Protein Kinase ErbB-1
Type:
Receptor Kinase Domain
Mol. Mass.:
134279.59
Organism:
Homo sapiens (Human)
Description:
P00533
Residue:
1210
  
Inhibitor
Name:
BDBM50391089
Synonyms:
BPI-2009 Conmana Lcotinib | US9783524, Icotinib
Type:
Small organic molecule
Emp. Form.:
C22H21N3O4
Mol. Mass.:
391.4198
SMILES:
C#Cc1cccc(Nc2ncnc3cc4OCCOCCOCCOc4cc23)c1
: