Target
Epidermal growth factor receptor
Ligand
BDBM149404
Substrate
Meas. Tech.
Kinase Assay (EGFR)(T790M)
IC50
13.7±n/a nM
Citation
 Hu, SLiu, XBai, JLong, W Protein tyrosine kinase modulators and methods of use US Patent  US9783524 Publication Date 10/10/2017 
Target
Name:
Epidermal growth factor receptor
Synonyms:
EGF Receptor Substrate EGFR_HUMAN ERBB1 Epidermal Growth Factor Receptor erbB-1 Epidermal growth factor receptor (EGFR) HER1 Proto-oncogene c-ErbB-1 Tyrosine-Protein Kinase ErbB-1
Type:
Receptor Kinase Domain
Mol. Mass.:
134279.59
Organism:
Homo sapiens (Human)
Description:
P00533
Residue:
1210
  
Inhibitor
Name:
BDBM149404
Synonyms:
AVL-301 CNX-419 Rociletinib US10167264, Compound CO-1686 US10434101, Compound I-4 US8975249, I-4 | US9783524, CO-1686
Type:
Small organic molecule
Emp. Form.:
C27H28F3N7O3
Mol. Mass.:
555.5515
SMILES:
COc1cc(ccc1Nc1ncc(c(Nc2cccc(NC(=O)C=C)c2)n1)C(F)(F)F)N1CCN(CC1)C(C)=O
: