Target
cGMP-inhibited 3',5'-cyclic phosphodiesterase 3B
Ligand
BDBM14758
Substrate
BDBM10851
Meas. Tech.
PDE Competitive Enzyme Inhibition Assay
Ki
748±n/a nM
Citation
 Chappie, TAHumphrey, JMAllen, MPEstep, KGFox, CBLebel, LALiras, SMarr, ESMenniti, FSPandit, JSchmidt, CJTu, MWilliams, RDYang, FV Discovery of a series of 6,7-dimethoxy-4-pyrrolidylquinazoline PDE10A inhibitors. J Med Chem 50:182-5 (2007)  
Target
Name:
cGMP-inhibited 3',5'-cyclic phosphodiesterase 3B
Synonyms:
CGI-PDE B CGIPDE1 PDE3B Phosphodiesterase 3B Phosphodiesterase Type 3 (PDE3B) cGMP-inhibited 3,5-cyclic phosphodiesterase B
Type:
Enzyme
Mol. Mass.:
124318.95
Organism:
Homo sapiens (Human)
Description:
PDE3B was generated from the full-length recombinant human clone transfected into Sf9 cells.
Residue:
1112
  
Inhibitor
Name:
BDBM14758
Synonyms:
(R)-6,7-Dimethoxy-4-[3-(pyridin-3-yloxy)-pyrrolidin-1-yl]-quinazoline 6,7-dimethoxy-4-[(3R)-3-(pyridin-3-yloxy)pyrrolidin-1-yl]quinazoline
Type:
Small organic molecule
Emp. Form.:
C19H20N4O3
Mol. Mass.:
352.3871
SMILES:
COc1cc2ncnc(N3CC[C@H](C3)Oc3cccnc3)c2cc1OC
:
Substrate
Name:
BDBM10851
Synonyms:
(4aR,6R,7R,7aS)-6-(6-amino-9H-purin-9-yl)-2,7-dihydroxy-hexahydro-1,3,5,2-furo[3,2-d][1,3,2]dioxaphosphinin-2-one ADENOSINE-3 ,5 -CYCLIC-MONOPHOSPHATE cAMP | cid_23902375
Type:
Small organic molecule
Emp. Form.:
C10H12N5O6P
Mol. Mass.:
329.2059
SMILES:
Nc1ncnc2n(cnc12)[C@@H]1O[C@@H]2COP(O)(=O)O[C@H]2[C@H]1O
: