Target
Intermediate conductance calcium-activated potassium channel protein 4
Ligand
BDBM205058
Substrate
Meas. Tech.
Inhibition Assay
pH
7.3±n/a
IC50
1700±0 nM
Comments
extracted
Citation
 Demnitz, JJorgensen, S Tetrazole derivatives and their use as potassium channel modulators US Patent  US9556132 Publication Date 1/31/2017 
Target
Name:
Intermediate conductance calcium-activated potassium channel protein 4
Synonyms:
IK1 KCA4 KCNN4_HUMAN SK4
Type:
PROTEIN
Mol. Mass.:
47723.22
Organism:
Homo sapiens (Human)
Description:
ChEMBL_1361891
Residue:
427
  
Inhibitor
Name:
BDBM205058
Synonyms:
US9556132, 22 | process for preparing 1-(2-fluorophenyl)-5-{2-[2-(trifluoromethyl)phenyl]phenyl}-1h-1,2,3,4-tetrazole
Type:
Small organic molecule
Emp. Form.:
C20H12F4N4
Mol. Mass.:
384.3297
SMILES:
Fc1ccccc1-n1nnnc1-c1ccccc1-c1ccccc1C(F)(F)F
: