Target
Mast/stem cell growth factor receptor Kit
Ligand
BDBM346025
Substrate
Meas. Tech.
In Vitro TK Inhibition Assay
EC50
<1000±n/a nM
Citation
 Moussy, ABenjahad, ASchalon, CPez, DChevenier, ESandrinelli, FMartin, JPicoul, W Benzimidazole derivatives as selective proteine kinase inhibitors US Patent  US10202370 Publication Date 2/12/2019 
Target
Name:
Mast/stem cell growth factor receptor Kit
Synonyms:
CD117 antigen KIT Mast/stem cell growth factor receptor Kit (cKIT) Proto-oncogene tyrosine-protein kinase Kit Stem cell growth factor receptor Tyrosine-protein kinase Kit c-kit v-kit Hardy-Zuckerman 4 feline sarcoma viral oncogene homolog
Type:
Protein
Mol. Mass.:
109869.37
Organism:
Homo sapiens (Human)
Description:
P10721
Residue:
976
  
Inhibitor
Name:
BDBM346025
Synonyms:
US10202370, Example 030 | [2-(3-Difluoromethyl- phenyl)-6-methyl- 3H-benzoimidazol-5- yl]-(4-pyridin-3-yl- pyrimidin-2-yl)- amine
Type:
Small organic molecule
Emp. Form.:
C24H18F2N6
Mol. Mass.:
428.4367
SMILES:
Cc1cc2nc([nH]c2cc1Nc1nccc(n1)-c1cccnc1)-c1cccc(c1)C(F)F
: