Target
Ubiquitin carboxyl-terminal hydrolase 2
Ligand
BDBM200235
Substrate
Meas. Tech.
Fluorometric Ub-AMC Hydrolysis Assay
pH
7.5±n/a
Temperature
298.15±n/a K
IC50
21200±n/a nM
Comments
extracted
Citation
 Ott, CABaljinnyam, BZakharov, AVJadhav, ASimeonov, AZhuang, Z Cell Lysate-Based AlphaLISA Deubiquitinase Assay Platform for Identification of Small Molecule Inhibitors. ACS Chem Biol 12:2399-2407 (2017)  
Target
Name:
Ubiquitin carboxyl-terminal hydrolase 2
Synonyms:
41 kDa ubiquitin-specific protease UBP2_HUMAN USP2 Ubiquitin-specific-processing protease 2
Type:
PROTEIN
Mol. Mass.:
68093.61
Organism:
Homo sapiens (Human)
Description:
ChEMBL_103660
Residue:
605
  
Inhibitor
Name:
BDBM200235
Synonyms:
Rifampicin | cid_5381226
Type:
Small organic molecule
Emp. Form.:
C43H58N4O12
Mol. Mass.:
822.9402
SMILES:
CO[C@H]1\C=C\O[C@@]2(C)Oc3c(C2=O)c2C(=O)\C(=C\NN4CCN(C)CC4)C(NC(=O)\C(C)=C/C=C/[C@H](C)[C@H](O)[C@@H](C)[C@@H](O)[C@@H](C)[C@H](OC(C)=O)[C@@H]1C)=C(O)c2c(O)c3C
: