Target
D-amino-acid oxidase
Ligand
BDBM196675
Substrate
Meas. Tech.
DAAO Inhibitory Activity Assay
IC50
2.20±n/a nM
Citation
 Hondo, TNakanishi, KNiimi, TWarizaya, MNamatame, IHarada, K Dihydroxy aromatic heterocyclic compound US Patent  US10202399 Publication Date 2/12/2019 
Target
Name:
D-amino-acid oxidase
Synonyms:
D-amino-acid oxidase (DAAO) DAMOX OXDA_HUMAN
Type:
Homodimer
Mol. Mass.:
39476.06
Organism:
Homo sapiens (Human)
Description:
P14920
Residue:
347
  
Inhibitor
Name:
BDBM196675
Synonyms:
US10202399, Example 237 | US9212147, 237
Type:
Small organic molecule
Emp. Form.:
C11H10N2O3
Mol. Mass.:
218.2087
SMILES:
Oc1n[nH]c(COc2ccccc2)cc1=O
: