Target
RAC-alpha serine/threonine-protein kinase
Ligand
BDBM15161
Substrate
biotinylated Akt peptide substrate
Meas. Tech.
Akt Inhibition Assay
pH
7.5±n/a
Temperature
295.15±n/a K
IC50
21200±n/a nM
Citation
 Lindsley, CWZhao, ZLeister, WHRobinson, RGBarnett, SFDefeo-Jones, DJones, REHartman, GDHuff, JRHuber, HEDuggan, ME Allosteric Akt (PKB) inhibitors: discovery and SAR of isozyme selective inhibitors. Bioorg Med Chem Lett 15:761-4 (2005)  
Target
Name:
RAC-alpha serine/threonine-protein kinase
Synonyms:
AKT phosphorylation (p-AKT) AKT1/PPP1CA C-AKT PKB alpha Protein kinase B Protein kinase B (Akt 1) Protein kinase B alpha Proto-oncogene Akt (Akt1) Proto-oncogene c-Akt (AKT1) RAC-PK-alpha RAC-alpha serine/threonine-protein kinase (AKT1) | RAC-alpha serine/threonine-protein kinase (pAKT)
Type:
Enzyme
Mol. Mass.:
55681.25
Organism:
Homo sapiens (Human)
Description:
P31749
Residue:
480
  
Inhibitor
Name:
BDBM15161
Synonyms:
1-[1-({4-[5-(2-methylpropyl)-6-oxo-3-phenyl-1,6-dihydropyrazin-2-yl]phenyl}methyl)piperidin-4-yl]-2,3-dihydro-1H-1,3-benzodiazol-2-one | pyrazinone 14f
Type:
Small organic molecule
Emp. Form.:
C33H35N5O2
Mol. Mass.:
533.6633
SMILES:
CC(C)Cc1nc(-c2ccccc2)c([nH]c1=O)-c1ccc(CN2CCC(CC2)n2c3ccccc3[nH]c2=O)cc1
:
Substrate
Name:
biotinylated Akt peptide substrate
Synonyms:
Type:
Peptide
Mol. Mass.:
1734.89
Organism:
Description:
Residue:
17
ITINGGRARTSSFAEPG