Target
RAC-gamma serine/threonine-protein kinase
Ligand
BDBM15156
Substrate
biotinylated Akt peptide substrate
Meas. Tech.
Akt Inhibition Assay
IC50
>50000±n/a nM
Citation
 Lindsley, CWZhao, ZLeister, WHRobinson, RGBarnett, SFDefeo-Jones, DJones, REHartman, GDHuff, JRHuber, HEDuggan, ME Allosteric Akt (PKB) inhibitors: discovery and SAR of isozyme selective inhibitors. Bioorg Med Chem Lett 15:761-4 (2005)  
Target
Name:
RAC-gamma serine/threonine-protein kinase
Synonyms:
AKT3 PKB gamma Protein kinase Akt-3 Protein kinase B, gamma RAC-gamma serine/threonine-protein kinase Serine/threonine-protein kinase AKT | Serine/threonine-protein kinase AKT3
Type:
Enzyme
Mol. Mass.:
55769.36
Organism:
Homo sapiens (Human)
Description:
Residue:
479
  
Inhibitor
Name:
BDBM15156
Synonyms:
1-{1-[(4-{6-[(4-hydroxyphenyl)methyl]-5-oxo-3-phenyl-4,5-dihydropyrazin-2-yl}phenyl)methyl]piperidin-4-yl}-2,3-dihydro-1H-1,3-benzodiazol-2-one | pyrazinone 13d
Type:
Small organic molecule
Emp. Form.:
C36H33N5O3
Mol. Mass.:
583.6789
SMILES:
Oc1ccc(Cc2nc(-c3ccc(CN4CCC(CC4)n4c5ccccc5[nH]c4=O)cc3)c([nH]c2=O)-c2ccccc2)cc1
:
Substrate
Name:
biotinylated Akt peptide substrate
Synonyms:
Type:
Peptide
Mol. Mass.:
1734.89
Organism:
Description:
Residue:
17
ITINGGRARTSSFAEPG