Target
RAC-alpha serine/threonine-protein kinase
Ligand
BDBM15188
Substrate
Ser-Thr 6 Peptide
Meas. Tech.
Z-LYTE Kinase Assy
pH
7.5±n/a
Temperature
298.15±n/a K
Ki
20800±n/a nM
IC50
25100±n/a nM
Citation
 Forino, MJung, DEaston, JBHoughton, PJPellecchia, M Virtual docking approaches to protein kinase B inhibition. J Med Chem 48:2278-81 (2005)  
Target
Name:
RAC-alpha serine/threonine-protein kinase
Synonyms:
AKT phosphorylation (p-AKT) AKT1/PPP1CA C-AKT PKB alpha Protein kinase B Protein kinase B (Akt 1) Protein kinase B alpha Proto-oncogene Akt (Akt1) Proto-oncogene c-Akt (AKT1) RAC-PK-alpha RAC-alpha serine/threonine-protein kinase (AKT1) | RAC-alpha serine/threonine-protein kinase (pAKT)
Type:
Enzyme
Mol. Mass.:
55681.25
Organism:
Homo sapiens (Human)
Description:
P31749
Residue:
480
  
Inhibitor
Name:
BDBM15188
Synonyms:
5-{5-[(1,3-dioxo-2,3-dihydro-1H-inden-2-ylidene)methyl]furan-2-yl}-2-hydroxybenzoic acid compound 3 | compound 5378650
Type:
Small organic molecule
Emp. Form.:
C21H12O6
Mol. Mass.:
360.3164
SMILES:
[#8]-[#6](=O)-c1cc(ccc1-[#8])-c1ccc(\[#6]=[#6]-2/[#6](=O)-c3ccccc3-[#6]-2=O)o1
:
Substrate
Name:
Ser-Thr 6 Peptide
Synonyms:
Type:
Peptide
Mol. Mass.:
358.43
Organism:
Description:
Substrate peptide provided by Z-LYTE assay kit (Invitrogen Corporation).
Residue:
3
NA