Target
Mitogen-activated protein kinase 14 [G110D]
Ligand
BDBM15240
Substrate
biotinylated GST-ATF2
Meas. Tech.
Enzyme Inhibition Scintillation Proximity Assay
pH
7±n/a
Temperature
303.15±n/a K
IC50
0.14±n/a nM
Km
48000±4000 nM
Citation
 Fitzgerald, CEPatel, SBBecker, JWCameron, PMZaller, DPikounis, VBO'Keefe, SJScapin, G Structural basis for p38alpha MAP kinase quinazolinone and pyridol-pyrimidine inhibitor specificity. Nat Struct Biol 10:764-9 (2003)  
Target
Name:
Mitogen-activated protein kinase 14 [G110D]
Synonyms:
Crk1 Csbp2 MK14_MOUSE Mitogen-activated protein kinase 14 | Mitogen-activated protein kinase p38 alpha
Type:
Enzyme
Mol. Mass.:
41338.25
Organism:
Mus musculus (mouse)
Description:
Mutant was site-directed generated from wild-type p38alpha.
Residue:
360
  
Inhibitor
Name:
BDBM15240
Synonyms:
4-[1-methyl-2-(piperidin-4-yl)-4-[3-(trifluoromethyl)phenyl]-1H-imidazol-5-yl]-N-[(1S)-1-phenylethyl]pyrimidin-2-amine CHEMBL305178 | pyrimidine imidazole compound 1
Type:
Small organic molecule
Emp. Form.:
C28H29F3N6
Mol. Mass.:
506.5653
SMILES:
C[C@H](Nc1nccc(n1)-c1c(nc(C2CCNCC2)n1C)-c1cccc(c1)C(F)(F)F)c1ccccc1
:
Substrate
Name:
biotinylated GST-ATF2
Synonyms:
ATF-2-GST Activating transcription factor 2 GST-ATF2 biotinylated activating transcription factor 2
Type:
Other Protein Type
Mol. Mass.:
12237.77
Organism:
Homo sapiens (Human)
Description:
Residue:
109