Target
Mitogen-activated protein kinase 14 [G110D]
Ligand
BDBM15242
Substrate
biotinylated GST-ATF2
Meas. Tech.
Enzyme Inhibition Scintillation Proximity Assay
pH
7±n/a
Temperature
303.15±n/a K
IC50
14±n/a nM
Km
48000±4000 nM
Citation
 Fitzgerald, CEPatel, SBBecker, JWCameron, PMZaller, DPikounis, VBO'Keefe, SJScapin, G Structural basis for p38alpha MAP kinase quinazolinone and pyridol-pyrimidine inhibitor specificity. Nat Struct Biol 10:764-9 (2003)  
Target
Name:
Mitogen-activated protein kinase 14 [G110D]
Synonyms:
Crk1 Csbp2 MK14_MOUSE Mitogen-activated protein kinase 14 | Mitogen-activated protein kinase p38 alpha
Type:
Enzyme
Mol. Mass.:
41338.25
Organism:
Mus musculus (mouse)
Description:
Mutant was site-directed generated from wild-type p38alpha.
Residue:
360
  
Inhibitor
Name:
BDBM15242
Synonyms:
1-(2,6-dichlorophenyl)-5-(2,4-difluorophenyl)-7-(4-piperidyl)-3,4-dihydroquinolin-2-one quinolinone compound 3
Type:
Small organic molecule
Emp. Form.:
C26H22Cl2F2N2O
Mol. Mass.:
487.368
SMILES:
Fc1ccc(c(F)c1)-c1cc(cc2N(C(=O)CCc12)c1c(Cl)cccc1Cl)C1CCNCC1
:
Substrate
Name:
biotinylated GST-ATF2
Synonyms:
ATF-2-GST Activating transcription factor 2 GST-ATF2 biotinylated activating transcription factor 2
Type:
Other Protein Type
Mol. Mass.:
12237.77
Organism:
Homo sapiens (Human)
Description:
Residue:
109