Target
Serine/threonine-protein kinase Chk1
Ligand
BDBM15265
Substrate
Cdc25C peptide substrate
Meas. Tech.
Chk1 Enzymatic Assay
pH
7.4±n/a
Temperature
295.15±n/a K
IC50
63±n/a nM
Citation
 Tao, ZFWang, LStewart, KDChen, ZGu, WBui, MHMerta, PZhang, HKovar, PJohnson, EPark, CJudge, RRosenberg, SSowin, TLin, NH Structure-based design, synthesis, and biological evaluation of potent and selective macrocyclic checkpoint kinase 1 inhibitors. J Med Chem 50:1514-27 (2007)  
Target
Name:
Serine/threonine-protein kinase Chk1
Synonyms:
CHEK1 CHK1 checkpoint homolog Checkpoint kinase-1 (CHK1)
Type:
Enzyme Catalytic Domain
Mol. Mass.:
54443.02
Organism:
Homo sapiens (Human)
Description:
gi_166295192
Residue:
476
  
Inhibitor
Name:
BDBM15265
Synonyms:
7-chloro-3-oxo-8-(pyridin-2-ylmethoxy)-11,17-dioxa-2,4,20,22-tetraazatricyclo[16.3.1.0^{5,10}]docosa-1(21),5(10),6,8,18(22),19-hexaene-19-carbonitrile | macrocyclic inhibitor 16n
Type:
Small organic molecule
Emp. Form.:
C23H21ClN6O4
Mol. Mass.:
480.904
SMILES:
Clc1cc2NC(=O)Nc3cnc(C#N)c(OCCCCCOc2cc1OCc1ccccn1)n3
:
Substrate
Name:
Cdc25C peptide substrate
Synonyms:
Type:
Peptide
Mol. Mass.:
2519.88
Organism:
Description:
Cdc25c peptide substrate contained a sequence of amino acid residues 204-225 of human phosphatase Cdc25C.
Residue:
22