Target
Mitogen-activated protein kinase 14
Ligand
BDBM256568
Substrate
Meas. Tech.
Enzyme Inhibition
IC50
245±n/a nM
Citation
 Thom, SM Kinase inhibitors US Patent  US9790174 Publication Date 10/17/2017 
Target
Name:
Mitogen-activated protein kinase 14
Synonyms:
CSAID-binding protein CSBP1 CSPB1 MAP kinase 14 MAP kinase p38 alpha MAPK14 MK14_HUMAN Mitogen-activated protein kinase p38 alpha Stress-activated protein kinase 2a | p38 MAP kinase alpha/beta
Type:
Serine/threonine-protein kinase
Mol. Mass.:
41286.76
Organism:
Homo sapiens (Human)
Description:
Q16539
Residue:
360
  
Inhibitor
Name:
BDBM256568
Synonyms:
US10435361, Example 67 US9790174, Example 67
Type:
Small organic molecule
Emp. Form.:
C45H52N6O9S
Mol. Mass.:
852.994
SMILES:
COCCOCCOC[C@H](C)NC(=O)c1cc(Nc2cc(Oc3ccc(NC(=O)Nc4cc(cc(NS(C)(=O)=O)c4OC)C(C)(C)C)c4ccccc34)ccn2)cc(c1)C#C
: