Target
Dihydroorotate dehydrogenase (quinone), mitochondrial
Ligand
BDBM1542
Substrate
BDBM14700
Meas. Tech.
DHODH Inhibition Assay
pH
8±n/a
Temperature
303.15±n/a K
IC50
280±n/a nM
Citation
 Baumgartner, RWalloschek, MKralik, MGotschlich, ATasler, SMies, JLeban, J Dual binding mode of a novel series of DHODH inhibitors. J Med Chem 49:1239-47 (2006)  
Target
Name:
Dihydroorotate dehydrogenase (quinone), mitochondrial
Synonyms:
DHODH Dihydroorotate dehydrogenase Dihydroorotate dehydrogenase, mitochondrial Dihydroorotate oxidase (DHODH) | PYRD_HUMAN
Type:
Enzyme
Mol. Mass.:
42881.33
Organism:
Homo sapiens (Human)
Description:
Q02127
Residue:
395
  
Inhibitor
Name:
BDBM1542
Synonyms:
2-({2-fluoro-4-[3-(trifluoromethoxy)phenyl]phenyl}carbamoyl)cyclopent-1-ene-1-carboxylic acid CHEMBL154493 Dipyridodiazepinone deriv. 31
Type:
Small organic molecule
Emp. Form.:
C20H15F4NO4
Mol. Mass.:
409.331
SMILES:
OC(=O)C1=C(CCC1)C(=O)Nc1ccc(cc1F)-c1cccc(OC(F)(F)F)c1
:
Substrate
Name:
BDBM14700
Synonyms:
2,3-dimethoxy-5-methyl-6-decyl-1,4-benzoquinone Decylubiquinone
Type:
Ubiquinone analog
Emp. Form.:
C19H30O4
Mol. Mass.:
322.4391
SMILES:
CCCCCCCCC=Cc1c(C)c(O)c(OC)c(OC)c1O
: