Target
Dipeptidyl peptidase 4
Ligand
BDBM15496
Substrate
BDBM11057
Meas. Tech.
DPP Inhibition Assay
Ki
7±n/a nM
Citation
 Backes, BJLongenecker, KHamilton, GLStewart, KLai, CKopecka, Hvon Geldern, TWMadar, DJPei, ZLubben, THZinker, BATian, ZBallaron, SJStashko, MAMika, AKBeno, DWKempf-Grote, AJBlack-Schaefer, CSham, HLTrevillyan, JM Pyrrolidine-constrained phenethylamines: The design of potent, selective, and pharmacologically efficacious dipeptidyl peptidase IV (DPP4) inhibitors from a lead-like screening hit. Bioorg Med Chem Lett 17:2005-12 (2007)  
Target
Name:
Dipeptidyl peptidase 4
Synonyms:
ADABP Adenosine deaminase complexing protein 2 CD_antigen=CD26 DPP4 DPPIV Dipeptidyl peptidase 4 (DPP IV) Dipeptidyl peptidase 4 (DPP4) Dipeptidyl peptidase 4 membrane form Dipeptidyl peptidase IV Dipeptidyl peptidase IV (DDP-IV) Dipeptidyl peptidase IV membrane form Dipeptidyl peptidase-IV (DPP-4) T-cell activation antigen CD26 | TP103
Type:
Enzyme
Mol. Mass.:
88271.01
Organism:
Homo sapiens (Human)
Description:
P27487
Residue:
766
  
Inhibitor
Name:
BDBM15496
Synonyms:
3-{6-[(3R,4S)-3-amino-4-(2,4,5-trifluorophenyl)pyrrolidin-1-yl]pyrimidin-4-yl}-N,N-dimethylbenzamide | Pyrrolidine-constrained phenethylamine 29e
Type:
Small organic molecule
Emp. Form.:
C23H22F3N5O
Mol. Mass.:
441.4489
SMILES:
CN(C)C(=O)c1cccc(c1)-c1cc(ncn1)N1C[C@H](N)[C@H](C1)c1cc(F)c(F)cc1F
:
Substrate
Name:
BDBM11057
Synonyms:
1-(2-aminoacetyl)-N-(4-methyl-2-oxo-2H-chromen-7-yl)pyrrolidine-2-carboxamide hydrobromide Gly-Pro-7-amidomethylcoumarin | Gly-Pro-AMC
Type:
Small organic molecule
Emp. Form.:
C17H19N3O4
Mol. Mass.:
329.3505
SMILES:
Cc1cc(=O)oc2cc(NC(=O)C3CCCN3C(=O)CN)ccc12
: