Target
Dipeptidyl peptidase 4
Ligand
BDBM15501
Substrate
BDBM11057
Meas. Tech.
DPP Inhibition Assay
pH
7.5±n/a
Temperature
295.15±n/a K
Ki
1600±n/a nM
Citation
 Pei, ZLi, Xvon Geldern, TWLongenecker, KPireh, DStewart, KDBackes, BJLai, CLubben, THBallaron, SJBeno, DWKempf-Grote, AJSham, HLTrevillyan, JM Discovery and structure-activity relationships of piperidinone- and piperidine-constrained phenethylamines as novel, potent, and selective dipeptidyl peptidase IV inhibitors. J Med Chem 50:1983-7 (2007)  
Target
Name:
Dipeptidyl peptidase 4
Synonyms:
ADABP Adenosine deaminase complexing protein 2 CD_antigen=CD26 DPP4 DPPIV Dipeptidyl peptidase 4 (DPP IV) Dipeptidyl peptidase 4 (DPP4) Dipeptidyl peptidase 4 membrane form Dipeptidyl peptidase IV Dipeptidyl peptidase IV (DDP-IV) Dipeptidyl peptidase IV membrane form Dipeptidyl peptidase-IV (DPP-4) T-cell activation antigen CD26 | TP103
Type:
Enzyme
Mol. Mass.:
88271.01
Organism:
Homo sapiens (Human)
Description:
P27487
Residue:
766
  
Inhibitor
Name:
BDBM15501
Synonyms:
(4R,5R)-5-amino-4-(2-chlorophenyl)-1-phenylpiperidin-2-one Piperidinone-Constrained Phenethylamine 16 | Racemic mixture
Type:
Small organic molecule
Emp. Form.:
C17H17ClN2O
Mol. Mass.:
300.783
SMILES:
N[C@H]1CN(C(=O)C[C@@H]1c1ccccc1Cl)c1ccccc1
:
Substrate
Name:
BDBM11057
Synonyms:
1-(2-aminoacetyl)-N-(4-methyl-2-oxo-2H-chromen-7-yl)pyrrolidine-2-carboxamide hydrobromide Gly-Pro-7-amidomethylcoumarin | Gly-Pro-AMC
Type:
Small organic molecule
Emp. Form.:
C17H19N3O4
Mol. Mass.:
329.3505
SMILES:
Cc1cc(=O)oc2cc(NC(=O)C3CCCN3C(=O)CN)ccc12
: