Target
Mitogen-activated protein kinase 1
Ligand
BDBM15631
Substrate
ERKtide
Meas. Tech.
Enzyme Inhibition Assay
Ki
660±n/a nM
Citation
 Aronov, AMBaker, CBemis, GWCao, JChen, GFord, PJGermann, UAGreen, JHale, MRJacobs, MJanetka, JWMaltais, FMartinez-Botella, GNamchuk, MNStraub, JTang, QXie, X Flipped out: structure-guided design of selective pyrazolylpyrrole ERK inhibitors. J Med Chem 50:1280-7 (2007)  
Target
Name:
Mitogen-activated protein kinase 1
Synonyms:
ERK2 Extracellular signal-regulated kinase 2 Extracellular signal-regulated kinase 2 (ERK2) MAPK 2 MK01_HUMAN Mitogen-activated protein kinase 1 (ERK-2) Mitogen-activated protein kinase 2 PRKM2 | p42-MAPK
Type:
Ser/Thr Protein Kinase
Mol. Mass.:
41392.76
Organism:
Homo sapiens (Human)
Description:
P28482
Residue:
360
  
Inhibitor
Name:
BDBM15631
Synonyms:
4-(4-(3-Chlorophenyl)-1H-pyrazol-3-yl)-N-((S)-1-phenylethyl)-1H-pyrrole-2-carboxamide Pyrrole Carboxamide Analog 6b
Type:
Small organic molecule
Emp. Form.:
C22H19ClN4O
Mol. Mass.:
390.865
SMILES:
C[C@H](NC(=O)c1cc(c[nH]1)-c1n[nH]cc1-c1cccc(Cl)c1)c1ccccc1
:
Substrate
Name:
ERKtide
Synonyms:
Type:
Peptide
Mol. Mass.:
1314.49
Organism:
Description:
Residue:
13
ATGPLSPGPFGRR