Target
Tyrosine-protein phosphatase non-receptor type 2
Ligand
BDBM15813
Substrate
BDBM13466
Meas. Tech.
PTP1B and TCPTP Inhibition Assay
Ki
290±n/a nM
Citation
 Xin, ZOost, TKAbad-Zapatero, CHajduk, PJPei, ZSzczepankiewicz, BGHutchins, CWBallaron, SJStashko, MALubben, TTrevillyan, JMJirousek, MRLiu, G Potent, selective inhibitors of protein tyrosine phosphatase 1B. Bioorg Med Chem Lett 13:1887-90 (2003)  
Target
Name:
Tyrosine-protein phosphatase non-receptor type 2
Synonyms:
PTN2_HUMAN PTPT T-cell protein-tyrosine phosphatase TCPTP Tyrosine-protein phosphatase non-receptor type 2 (TC-PTP)
Type:
Protein
Mol. Mass.:
48481.80
Organism:
Homo sapiens (Human)
Description:
P17706
Residue:
415
  
Inhibitor
Name:
BDBM15813
Synonyms:
1:1 mixture of diastereomers oxalyl-aryl-amino benzoic acid-based inhibitor 13
Type:
Small organic molecule
Emp. Form.:
C35H44N4O10
Mol. Mass.:
680.7447
SMILES:
CCc1cc(CC(NC(C)=O)C(=O)NCCCCC(=O)N[C@@H](C2CCCCC2)C(O)=O)ccc1N(C(=O)C(O)=O)c1ccccc1C(O)=O
:
Substrate
Name:
BDBM13466
Synonyms:
4-Nitrophenyl phosphate disodium salt hexahydrate disodium (4-nitrophenyl) phosphate | para-nitrophenyl phosphate (pNPP)
Type:
Small organic molecule
Emp. Form.:
C6H4NO6P
Mol. Mass.:
217.0739
SMILES:
[O-][N+](=O)c1ccc(O[P+]([O-])([O-])[O-])cc1
: