Target
Mitogen-activated protein kinase 9
Ligand
BDBM15907
Substrate
biotinylated GST-ATF2
Meas. Tech.
Kinase Selectivity Assay
Ki
440±n/a nM
Citation
 Szczepankiewicz, BGKosogof, CNelson, LTLiu, GLiu, BZhao, HSerby, MDXin, ZLiu, MGum, RJHaasch, DLWang, SClampit, JEJohnson, EFLubben, THStashko, MAOlejniczak, ETSun, CDorwin, SAHaskins, KAbad-Zapatero, CFry, EHHutchins, CWSham, HLRondinone, CMTrevillyan, JM Aminopyridine-based c-Jun N-terminal kinase inhibitors with cellular activity and minimal cross-kinase activity. J Med Chem 49:3563-80 (2006)  
Target
Name:
Mitogen-activated protein kinase 9
Synonyms:
JNK-55 JNK2/JNK3 MK09_HUMAN Mitogen-activated protein kinase 8/9 SAPK1A c-Jun N-terminal kinase 2 | c-Jun N-terminal kinase 2 (JNK2)
Type:
Enzyme
Mol. Mass.:
48131.49
Organism:
Homo sapiens (Human)
Description:
JNK-2 was purchased from Upstate Cell Signaling Solutions (formerly Upstate Biotechnology).
Residue:
424
  
Inhibitor
Name:
BDBM15907
Synonyms:
Aminopyridine-Based Inhibitor 6a aminopyridine deriv. 1
Type:
Small organic molecule
Emp. Form.:
C10H12N4O2
Mol. Mass.:
220.2279
SMILES:
CCOc1nc(NC(C)=O)cc(N)c1C#N
:
Substrate
Name:
biotinylated GST-ATF2
Synonyms:
ATF-2-GST Activating transcription factor 2 GST-ATF2 biotinylated activating transcription factor 2
Type:
Other Protein Type
Mol. Mass.:
12237.77
Organism:
Homo sapiens (Human)
Description:
Residue:
109