Target
Mitogen-activated protein kinase 8
Ligand
BDBM15982
Substrate
biotinylated GST-ATF2
Meas. Tech.
ATF-2 Phosphorylation Assay
pH
7.2±n/a
Temperature
293.15±n/a K
IC50
>100000±n/a nM
Citation
 Liu, MWang, SClampit, JEGum, RJHaasch, DLRondinone, CMTrevillyan, JMAbad-Zapatero, CFry, EHSham, HLLiu, G Discovery of a new class of 4-anilinopyrimidines as potent c-Jun N-terminal kinase inhibitors: Synthesis and SAR studies. Bioorg Med Chem Lett 17:668-72 (2007)  
Target
Name:
Mitogen-activated protein kinase 8
Synonyms:
JNK-46 JNK1-alpha-1 MK08_HUMAN PRKM8 SAPK1C c-Jun N-terminal kinase 1 c-Jun N-terminal kinase 1(JNK1) | c-Jun N-terminal kinase 2 (JNK2)
Type:
Enzyme
Mol. Mass.:
48297.57
Organism:
Homo sapiens (Human)
Description:
JNK-1 was purchased from Upstate Cell Signaling Solutions (formerly Upstate Biotechnology).
Residue:
427
  
Inhibitor
Name:
BDBM15982
Synonyms:
2-{[2-(hexyloxy)pyrimidin-4-yl]amino}benzoic acid | 4-anilinopyrimidine 6d
Type:
Small organic molecule
Emp. Form.:
C17H21N3O3
Mol. Mass.:
315.3669
SMILES:
CCCCCCOc1nccc(Nc2ccccc2C(O)=O)n1
:
Substrate
Name:
biotinylated GST-ATF2
Synonyms:
ATF-2-GST Activating transcription factor 2 GST-ATF2 biotinylated activating transcription factor 2
Type:
Other Protein Type
Mol. Mass.:
12237.77
Organism:
Homo sapiens (Human)
Description:
Residue:
109