Target
Beta-secretase 1 [1-453]
Ligand
BDBM16056
Substrate
BACE Peptide Substrate
Meas. Tech.
Enzyme Inhibition Measurements
pH
4.5±n/a
Temperature
295.15±n/a K
IC50
1820±n/a nM
Citation
 Hanessian, SYun, HHou, YYang, GBayrakdarian, MTherrien, EMoitessier, NRoggo, SVeenstra, STintelnot-Blomley, MRondeau, JMOstermeier, CStrauss, ARamage, PPaganetti, PNeumann, UBetschart, C Structure-based design, synthesis, and memapsin 2 (BACE) inhibitory activity of carbocyclic and heterocyclic peptidomimetics. J Med Chem 48:5175-90 (2005)  
Target
Name:
Beta-secretase 1 [1-453]
Synonyms:
ASP2 Aspartyl protease 2 BACE1 Beta-site APP cleaving enzyme 1 KIAA1149 Membrane-associated aspartic protease 2 | beta-Secretase (BACE-1)
Type:
Enzyme
Mol. Mass.:
50193.81
Organism:
Homo sapiens (Human)
Description:
Recombinant human BACE (SwissProt accession number P56817, amino acids 1-453 + a thrombin-cleavable C-kappa tag) was produced in-house using Sf9 insect cells.
Residue:
453
  
Inhibitor
Name:
BDBM16056
Synonyms:
(1R,2R)-N-butyl-2-[(1S,2S)-2-[(2S)-2-[(2S)-2-acetamido-4-methylpentanamido]-4-(methylsulfanyl)butanamido]-1-hydroxy-4-methylpentyl]cyclopentane-1-carboxamide truncated OM99-2 cyclopentano analog 50
Type:
Small organic molecule
Emp. Form.:
C29H54N4O5S
Mol. Mass.:
570.828
SMILES:
[H][C@]1(CCC[C@H]1C(=O)NCCCC)[C@H](O)[C@H](CC(C)C)NC(=O)[C@H](CCSC)NC(=O)[C@H](CC(C)C)NC(C)=O
:
Substrate
Name:
BACE Peptide Substrate
Synonyms:
Type:
Peptide
Mol. Mass.:
1917.56
Organism:
Description:
Peptide substrates were obtained from Bachem (Bubendorf, Switzerland).
Residue:
17
MCASEVNLDAEFKDNPH